zakelijk recht of tracévergunning
type: Concept
source: NBility
broader: energienet (domein)
definition: (volledig of beperkt) recht op een stuk grond (zakelijk recht), of een toestemming van het bevoegd gezag (vergunning), om in een bepaald tracé netcomponenten in bezit te hebben
status: valid

bedrijfsprestatie
type: Concept
source: NBility
broader: richting (domein)
definition: mate waarin een organisatie een gesteld doel of verplichting volbrengt
status: valid

privacyrisico
type: Concept
source: NBility
broader: richting (domein)
definition: effect van onzekerheid ten aanzien van de beperking van rechten en vrijheden van personen als gevolg van de verwerking van hun persoonsgegevens
status: valid

netcomponentconditie
type: Concept
source: NBility
broader: energienet (domein)
definition: (technische) toestand waarin een netcomponent verkeert
status: valid

investeringsplan
type: Concept
source: NBility
broader: energienet (domein)
definition: door de netbeheerder periodiek opgesteld plan waarin alle noodzakelijke uitbreidings- en vervangingsinvesteringen worden beschreven en onderbouwd
status: valid

medewerkersovereenkomst
type: Concept
source: NBility
broader: medewerker (domein)
definition: afspraak waarbij een natuurlijk persoon, niet als onderneming, zich verbindt in opdracht van een organisatie werk te verrichten
status: valid

aanwezige transportcapaciteit
type: Concept
source: Begrippencode elektriciteit
broader: transportcapaciteit
definition: maximale capaciteit die een energienet aankan, met inachtneming van de van toepassing zijnde netontwerpcriteria en operationele veiligheidsgrenzen
scope note: De transportcapaciteit beschikbaar door congestiemanagement of 'verzwaren tenzij' telt niet als aanwezige transportcapaciteit. Dit is in lijn met de Handleiding congestierapporten (ACM, 2023).
status: valid

afname
type: Concept
alternative label: levering
alternative label: verbruik
broader: energierichting
definition: onttrekking van energie aan het energienet
status: valid

aansluitlocatie
type: Concept
broader: overdrachtspunt
definition: plek waar zich het overdrachtspunt van een aansluiting of netkoppeling bevindt
status: valid

verantwoordingsrapport
type: Concept
source: NBility
broader: richting (domein)
definition: officiële uitleg of verklaring van de activiteiten van de netbeheerder aan een niet-financiële regulator
status: valid

bedrijfsrisico
type: Concept
source: NBility
broader: richting (domein)
definition: effect van onzekerheid ten aanzien van de doelstellingen of resultaten van een organisatie
status: valid

bedrijfscontinuïteitsplan
type: Concept
source: NBility
broader: richting (domein)
definition: document dat een organisatie gebruikt om haar activiteiten te herstellen na een ontwrichtend incident
status: valid

netcomponentprestatie
type: Concept
source: NBility
broader: energietransport (domein)
definition: vermogen van een netcomponent om te voldoen aan functionele eisen of doelstellingen
status: valid

bedieningssituatie
type: Concept
source: NBility
broader: energietransport (domein)
definition: toestand van een of meer regelbare eenheden (zoals schakelaars) in het energienet die van invloed zijn op het energietransport
status: valid

schadevergoeding
type: Concept
source: NBility
broader: klant (domein)
definition: geldbedrag dat een klant krijgt voor schade aan diens installatie ten gevolge van werkzaamheden in opdracht van de netbeheerder
status: valid

inkomstenverlies
type: Concept
source: NBility
broader: klant (domein)
definition: verlies van potentiële inkomsten
status: valid

klantervaring
type: Concept
source: NBility
broader: klant (domein)
definition: subjectieve beleving van een klant naar aanleiding van direct of indirect contact met de netbeheerder
status: valid

schadeverhaal
type: Concept
source: NBility
broader: klant (domein)
definition: aansprakelijkstelling van schade aan het energienet veroorzaakt door derden, anders dan door energiediefstal
status: valid

financiële beheersmaatregel
type: Concept
source: NBility
broader: financiën (domein)
definition: handeling waarmee een organisatie het gebruik van haar financiële middelen bewaakt
status: valid

rechtsregel
type: Concept
source: NBility
broader: richting (domein)
definition: algemene bepaling in het recht die in beginsel een bindende werking heeft
status: valid

laaguren
type: Concept
source: Begrippencode elektriciteit
broader: energie-uitwisseling
definition: uren van de dag waarvoor, in geval van een meetinrichting met dubbel telwerk, de met het energienet uitgewisselde energie wordt geregistreerd door het laagtelwerk
status: valid

technische bedrijfsstandaard
type: Concept
source: NBility
broader: energienet (domein)
definition: norm die aangeeft waaraan een bepaald product in technisch opzicht zou moeten voldoen
status: valid

power park module
type: Concept
source: Verordening (EU) 2016/631 (NC RfG)
broader: elektriciteitsproductie-eenheid
definition: eenheid of verzameling van eenheden die elektriciteit opwekt, die ofwel niet-synchroon ofwel via vermogenselektronica via één overdrachtspunt met het energienet is verbonden
status: submitted

contractloze situatie
type: Concept
source: NBility
broader: klant (domein)
definition: toestand waarin er een actieve aansluiting is zonder leveringsovereenkomst
status: valid

financieel verslag
type: Concept
source: NBility
broader: financiën (domein)
definition: overzicht van de financiële situatie van een organisatie
status: valid

klantproduct
type: Concept
source: NBility
broader: klant (domein)
definition: al dan niet tastbaar iets dat de netbeheerder aanbiedt om aan een wens of behoefte te voldoen
status: valid

informatiebeveiligingsrisico
type: Concept
source: NBility
broader: richting (domein)
definition: effect van onzekerheid ten aanzien van het behoud van de vertrouwelijkheid, de integriteit en de beschikbaarheid van informatie
status: valid

graafbericht
type: Concept
source: NBility
broader: energienet (domein)
definition: bericht aan de netbeheerder van de Dienst voor het kadaster en de openbare registers nadat deze een oriëntatieverzoek of graafmelding heeft ontvangen
status: valid

groepscapaciteitssturingscontract
type: Concept
alternative label: G-CSC
broader: capaciteitssturingscontract
definition: capaciteitssturingscontract tussen een netbeheerder en een CSP met betrekking tot een groep van aansluitingen
status: submitted

meting
type: Concept
source: NBility
broader: meting (domein)
definition: aan het energienet gerelateerde waardebepaling met behulp van een meetinstrument
status: valid

benodigde transportcapaciteit
type: Concept
source: Begrippencode elektriciteit
broader: transportcapaciteit
definition: transportcapaciteit nodig om transportovereenkomsten uit te voeren
editorial note: De definitie uit de Begrippencode elektriciteit is verfijnd om nieuwe transportverzoeken van reeds gecontracteerde aangeslotenen uit te sluiten. Dit is in lijn met de Handleiding congestierapporten (ACM, 2023).
scope note: Het betreft de transportcapaciteit die tijdens spitsmomenten nodig is op het beperkende netelement.
scope note: Het deel van een transportovereenkomst waarvoor een zogenaamde transportbeperking is opgelegd, geldt niet als benodigde transportcapaciteit.
scope note: In de praktijk reserveren netbeheerders transportcapaciteit voor maatschappelijk belangrijke doelen zoals woningbouw, en rekenen die in sommige gevallen tot de benodigde transportcapaciteit. Zuiverder zou zijn om deze in een aparte categorie onder te brengen zoals 'maatschappelijke reserve'. In de Evaluatie congestiemanagement (2023) merkt de ACM op dat deze vorm van transportcapaciteit nog niet als zodanig in de Netcode is opgenomen.
status: valid

marktverzoek
type: Concept
source: NBility
broader: energiemarkt (domein)
definition: vraag van een marktpartij om iets te doen, niet zijnde een marktprocesverzoek
status: valid

gevraagde transportcapaciteit
type: Concept
source: Begrippencode elektriciteit
broader: transportcapaciteit
definition: transportcapaciteit nodig om transportverzoeken uit te voeren
editorial note: De definitie uit de Begrippencode elektriciteit is verfijnd om de vraag naar transport waar reeds een transportovereenkomst voor bestaat uit te sluiten en om de suggestie weg te nemen dat de waarden niet optelbaar zijn. Dit is in lijn met de Handleiding congestierapporten (ACM, 2023).
scope note: Het betreft de transportcapaciteit die tijdens spitsmomenten nodig is op het beperkende netelement.
scope note: Het deel van een transportovereenkomst waarvoor een zogenaamde transportbeperking is opgelegd, geldt als gevraagde transportcapaciteit.
status: valid

medewerkersprestatie
type: Concept
source: NBility
broader: medewerker (domein)
definition: mate waarin een medewerker gestelde doelen of verplichtingen volbrengt
status: valid

snellaadinstallatie
type: Concept
broader: laadinstallatie
definition: laadinstallatie met een laadpunt geschikt voor het laden met een capaciteit van 50 kW of meer
status: submitted

congestiegebied
type: Concept
source: NBility
broader: energiemarkt (domein)
definition: gebied waarin de te verwachten behoefte aan transport redelijkerwijs kan leiden tot een structureel tekort aan transportcapaciteit
status: valid

storing
type: Concept
source: NBility
broader: energietransport (domein)
definition: niet gewenste verandering in de werking van een netcomponent, netdeel of bijbehorende bedrijfsomstandigheden
status: valid

voedingsgebied
type: Concept
broader: netfunctie
definition: deel van het aardoppervlak waar zich de overdrachtspunten van aansluitingen bevinden die worden gevoed door een bepaald deel van het energienet
status: submitted

veranderportfolio
type: Concept
source: NBility
broader: richting (domein)
definition: globale planning van gewenste veranderingen
status: valid

klantcontactmoment
type: Concept
source: NBility
broader: klant (domein)
definition: aaneengesloten periode waarbij interactief informatie wordt uitgewisseld tussen een klant en de netbeheerder
status: valid

storingscompensatie
type: Concept
source: NBility
broader: klant (domein)
definition: geldbedrag dat een klant krijgt voor de onderbreking van de transportdienst ten gevolge van een storing
status: valid

veranderinitiatief
type: Concept
source: NBility
broader: richting (domein)
definition: verandering van de structuur en/of werkwijze van een organisatie
status: valid

bedrijfsplan
type: Concept
source: NBility
broader: richting (domein)
definition: door een organisatie in detail voorgenomen handelswijze om haar doelstellingen te realiseren
status: valid

financieel feit
type: Concept
source: NBility
broader: financiën (domein)
definition: geldelijke waardering van een gebeurtenis
status: valid

campagne
type: Concept
source: NBility
broader: richting (domein)
definition: samenhangende reeks activiteiten in communicatie
status: valid

elektriciteitsopslageenheid
type: Concept
source: Begrippencode elektriciteit
broader: opslaginstallatie
definition: eenheid die actief vermogen vanuit het net kan afnemen en in het net kan injecteren door omzetting van elektrische energie in een vorm van energie die kan worden opgeslagen, de opslag van die energie en de daaropvolgende omzetting van die energie in elektrische energie
status: valid

proces
type: Concept
source: NBility
broader: proces en data (domein)
definition: ordening van repetitief uit te voeren werk, gericht op een beoogd resultaat
status: valid

transportverzoek
type: Concept
source: Netcode elektriciteit
broader: klantverzoek
definition: aanvraag voor het beschikbaar stellen van capaciteit voor het transport van energie
scope note: Hieronder wordt verstaan een verzoek om het verhogen van de gecontracteerde transportcapaciteit. Bij een kleinverbruikaansluiting is de gecontracteerde transportcapaciteit gelijk aan de aansluitcapaciteit en is een verhoging van de aansluitcapaciteit een impliciet transportverzoek.
status: valid

bedieningsplan
type: Concept
source: NBility
broader: energietransport (domein)
definition: omschrijving van de bedieningshandelingen die uitgevoerd moeten worden en die leiden tot een gewenste bedrijfssituatie
status: valid

transportprognose
type: Concept
source: NBility
broader: energietransport (domein)
definition: bij een netbeheerder ingediende planning van energie-uitwisseling
scope note: In een volgende versie van NBility wordt deze mogelijk gewijzigd naar energieplanning.
status: submitted

netcomponentconfiguratie
type: Concept
source: NBility
broader: energietransport (domein)
definition: verzameling van instellingen van een netcomponent die de werking ervan bepalen
status: valid

hoge druk
type: Concept
source: Begrippencode gas
alternative label: HD
broader: drukniveau
definition: drukniveau hoger dan 200 mbar en lager dan of gelijk aan 8 bar
status: submitted

financieel advies
type: Concept
source: NBility
broader: financiën (domein)
definition: raadgeving die primair verband houdt met de financiën
status: valid

volledig vast transportrecht
type: Concept
broader: transportrecht
definition: transportrecht dat altijd geldt
status: submitted

tijdsblokgebonden transportrecht
type: Concept
alternative label: blokstroom
broader: alternatief transportrecht
definition: transportrecht dat geldt gedurende vooraf vastgestelde tijdsblokken
status: submitted

tijdsduurgebonden transportrecht
type: Concept
broader: alternatief transportrecht
definition: transportrecht dat geldt gedurende een vooraf bepaald aandeel van de totale tijd, zonder koppeling aan vaste tijdstippen
status: submitted

op afstand uitleesbare kleinverbruikmeetinrichting
type: Concept
source: Begrippencode elektriciteit
alternative label: slimme meter
broader: kleinverbruikmeetinrichting
definition: meetinrichting die voldoet aan het Besluit op afstand uitleesbare meetinrichtingen
scope note: (Mogelijk enige) deel van een op afstand uitleesbare kleinverbruikmeetinrichting is de comptabele energiehoeveelheidsmeter met communicatiefunctionaliteit. Deze staat ook wel bekend als slimme meter.
status: valid

extrahoge druk
type: Concept
source: Begrippencode gas
alternative label: EHD
broader: drukniveau
definition: drukniveau hoger dan 8 bar
status: submitted

CSP
type: Concept
broader: marktpartij
definition: partij die namens of met instemming van een aangeslotene congestiemanagementdiensten levert aan een netbeheerder
hidden label: congestiebeheersdienstverlener
hidden label: congestiemanagementdienstverlener
scope note: CSP staat voor congestion service provider.
status: valid

juridisch advies
type: Concept
source: NBility
broader: richting (domein)
definition: raadgeving die primair verband houdt met het recht
status: valid

klantfactuur
type: Concept
source: NBility
broader: klant (domein)
definition: weergave van een betalingsverplichting van of aan een klant
status: valid

niet-marktgebaseerde bieding redispatch
type: Concept
broader: bieding redispatch
definition: bieding redispatch op verzoek van de netbeheerder, tegen niet-marktgebaseerde voorwaarden
status: submitted

reisbeweging
type: Concept
source: NBility
broader: bedrijfsgebouw (domein)
definition: vrijwillige verplaatsing van een persoon van een bepaalde locatie naar een andere locatie
status: valid

werkplan
type: Concept
source: NBility
broader: werk (domein)
definition: omschrijving van alle werkzaamheden die uitgevoerd moeten worden
status: valid

synchrone elektriciteitsproductie-eenheid
type: Concept
source: Verordening (EU) 2016/631 (NC RfG)
broader: elektriciteitsproductie-eenheid
definition: ondeelbaar geheel van installaties die samen elektrische energie kunnen opwekken op dusdanige wijze dat de frequentie van de opgewekte spanning, het toerental van de generator en de frequentie van de netspanning in constante verhouding tot elkaar staan en dus synchroon lopen
status: submitted

vitaliteitsprogramma
type: Concept
source: NBility
broader: medewerker (domein)
definition: gestructureerd en georganiseerd initiatief gericht op het bevorderen van de algehele gezondheid, welzijn en veerkracht van medewerkers
status: valid

gecontracteerde transportcapaciteit
type: Concept
source: Begrippencode elektriciteit
broader: transportrecht
definition: maximale capaciteit die op een aansluiting of groep van aansluitingen mag worden gebruikt
hidden label: GTV
hidden label: gecontracteerd transportvermogen
status: valid

energiedrager
type: Concept
source: Energiedrager
alternative label: productsoort
broader: energie-uitwisseling
definition: medium dat bruikbare energie bevat
example: elektriciteit
example: gas
example: waterstof
status: valid

klantofferte
type: Concept
source: NBility
broader: klant (domein)
definition: formeel aanbod tot het sluiten van een overeenkomst, opgesteld op verzoek van een (potentiële) klant
status: valid

digitaalproductstrategie
type: Concept
source: NBility
broader: digitaal product (domein)
definition: algemene aanpak die een organisatie hanteert om digitale producten te ontwikkelen en beheren zodat zij haar doelstellingen realiseert
status: valid

aansluittermijn
type: Concept
broader: klantovereenkomst
definition: periode tussen de ontvangst van de aansluitovereenkomst door de netbeheerder en de beschikbaarstelling van de daarin overeengekomen fysieke aansluitverbinding(en) aan de contractpartij
status: submitted

grote aansluiting
type: Concept
source: Energiewet
broader: aansluiting
definition: aansluiting met een doorlaatwaarde groter dan 3 x 80 Ampère voor elektriciteit of 40 m3(n) per uur voor gas
scope note: Een aansluiting voor een streng van lichtmasten, waarbij elke lichtmast een eigen overdrachtspunt heeft met een doorlaatwaarde van ten hoogste 1 x 6 Ampère, geldt als kleine aansluiting, ongeacht het aantal overdrachtspunten.
status: valid

digitaal product
type: Concept
source: NBility
broader: digitaal product (domein)
definition: dienst voor het leveren van beheerde software
status: valid

omgevingsanalyse
type: Concept
source: NBility
broader: energienet (domein)
definition: omschrijving van de fysieke leefomgeving en het eigenaarschap van de grond, waar rekening mee moet worden gehouden bij de uitvoering van de bedrijfsactiviteiten
status: valid

voorlopig of definitief ontwerp
type: Concept
source: NBility
broader: werk (domein)
definition: omschrijving die laat zien hoe een netaanpassing er technisch uit gaat zien
status: valid

digitaalproductwijziging
type: Concept
source: NBility
broader: digitaal product (domein)
definition: verandering van een digitaal product
status: valid

energiemarkt
type: Concept
source: NBility
broader: energiemarkt (domein)
definition: (virtuele) handelsplaats voor energie
status: valid

standaardjaarafname
type: Concept
source: Begrippencode elektriciteit
alternative label: SJA
broader: standaardjaarvolume
definition: verwachte afname op een aansluiting bij gestandaardiseerde condities en op basis van een genormaliseerd jaar
status: valid

onderbreking
type: Concept
source: NBility
broader: energietransport (domein)
definition: interruptie of beperking van het transport van energie bij één of meer afnemers
status: valid

data-analysemodel
type: Concept
source: NBility
broader: proces en data (domein)
definition: algoritme bedoeld om bij toepassing op een dataset waardevolle informatie te genereren
status: valid

transportanalyse
type: Concept
source: NBility
broader: energietransport (domein)
definition: analyse van energietransport binnen het bestaande energienet om benodigde aanpassingen in transport te bepalen
status: valid

extrahoogspanning
type: Concept
alternative label: EHS
broader: spanningsniveau
definition: spanningsniveau van 220 kV of hoger
scope note: Spanningsniveaus worden op verschillende manieren gedefinieerd. Deze definitie gaat uit van de door netbeheerders meest gebruikte indeling. Andere indelingen kennen vaak geen extrahoogspanning.
status: submitted

medewerker
type: Concept
source: NBility
broader: medewerker (domein)
definition: natuurlijk persoon die activiteiten uitvoert in opdracht van een organisatie
status: valid

allocatiepunt
type: Concept
source: Energiewet
broader: aansluiting
definition: administratief punt waar energie-uitwisseling wordt toegerekend aan een marktdeelnemer
status: valid

VGMK-incident
type: Concept
source: NBility
broader: richting (domein)
definition: ongewenst voorval dat voortvloeit uit bedrijfsactiviteiten en mogelijk schade of letsel tot gevolg heeft
status: valid

lage druk
type: Concept
source: Begrippencode gas
alternative label: LD
broader: drukniveau
definition: drukniveau van 200 mbar of lager
status: submitted

case
type: Concept
source: NBility
broader: proces en data (domein)
definition: samenhangende hoeveelheid werk met een welgedefinieerde aanleiding en een welgedefinieerd eindresultaat, waarvan kwaliteit en doorlooptijd bewaakt moeten worden
status: valid

contract voor redispatchcapaciteit
type: Concept
broader: klantovereenkomst
definition: afspraak om op verzoek van de netbeheerder biedingen redispatch te doen
status: submitted

laagtelwerk
type: Concept
source: Begrippencode elektriciteit
broader: telwerk
definition: telwerk van een meetinrichting met twee of meer telwerken dat gebruikt wordt of kan worden voor de bepaling van de met het energienet uitgewisselde energie tijdens laaguren
status: valid

netverliescompensatie
type: Concept
source: NBility
broader: klant (domein)
definition: verkrijgen van energie om het technische dan wel administratieve verschil tussen de invoeding en afname te compenseren
status: valid

competentie
type: Concept
source: NBility
broader: medewerker (domein)
definition: verzameling van kennis, ervaring en persoonlijke vaardigheden om een functie, taak of rol met succes te vervullen
status: valid

klantnotificatie
type: Concept
source: NBility
broader: klant (domein)
definition: aan een klant gerichte officiële kennisgeving van een verandering in de status van een dienst
status: valid

maximumcapaciteit
type: Concept
source: Verordening (EU) 2016/631 (NC RfG)
broader: installatie
definition: hoogste hoeveelheid energie per tijdseenheid die een installatie continu met het energienet kan en mag uitwisselen
status: valid

dataset
type: Concept
source: NBility
broader: proces en data (domein)
definition: verzameling gegevens die als geheel wordt verwerkt
status: valid

goederenbeweging
type: Concept
source: NBility
broader: werk (domein)
definition: fysieke of logische verplaatsing van goederen
status: valid

inkoopproduct
type: Concept
source: NBility
broader: inkoopproduct (domein)
definition: tegen betaling verkregen product of dienst
status: valid

archiefstuk
type: Concept
source: NBility
broader: proces en data (domein)
definition: document dat bestemd is om te bewaren door de organisatie die het heeft gemaakt of ontvangen bij de uitvoering van haar activiteiten
status: valid

functioneel ontwerp
type: Concept
source: NBility
broader: energienet (domein)
definition: specificatie van eisen aan een netaanpassing en de gekozen oplossingsrichting
status: valid

energiediefstal
type: Concept
source: NBility
broader: klant (domein)
definition: situatie waarbij op illegale wijze energie wordt onttrokken aan het energienet
status: valid

uitvoeringscapaciteit
type: Concept
source: NBility
broader: werk (domein)
definition: vermogen van medewerkers om werkactiviteiten uit te voeren
status: valid

innovatie
type: Concept
source: NBility
broader: richting (domein)
definition: idee voor een nieuw goed, dienst of proces, of combinatie daarvan
status: valid

inkoopplan
type: Concept
source: NBility
broader: inkoopproduct (domein)
definition: door een organisatie in detail voorgenomen handelswijze om goederen en diensten te verkrijgen zodat zij haar doelstellingen realiseert
status: valid

meter
type: Concept
broader: netcomponent
definition: apparaat bedoeld om energie-uitwisseling te meten ten behoeve van de verrekening
scope note: Een apparaat dat niet ten behoeve van de verrekening meet, noemen we een sensor.
status: valid

financiering
type: Concept
source: NBility
broader: financiën (domein)
definition: verstrekking van benodigde geldmiddelen
status: valid

onderhouds- of inspectieplan
type: Concept
source: NBility
broader: energienet (domein)
definition: omschrijving van de beoogde activiteiten aan netcomponenten die nodig zijn om het energienet in aanvaardbare conditie te houden
status: valid

werkmiddel
type: Concept
source: NBility
broader: werk (domein)
definition: gebruiksvoorwerp zoals een stuk gereedschap (bouwmaterieel) of voertuig (rollend materieel) dat wordt gebruikt om te werken aan het energienet
status: valid

architectuurproduct
type: Concept
source: NBility
broader: richting (domein)
definition: beschrijving van de huidige en/of toekomstige structuur en werking van een organisatie om deze te begrijpen, te communiceren en te beheren
status: valid

marktactiviteit
type: Concept
source: NBility
broader: energiemarkt (domein)
definition: verrichten van een dienst door een marktpartij op een aansluiting
status: valid

standaard werkproduct
type: Concept
source: NBility
broader: werk (domein)
definition: regelmatig terugkerend werk, met een norm voor de benodigde uren, materialen en/of instructies
status: valid

tussenspanning
type: Concept
alternative label: TS
broader: spanningsniveau
definition: spanningsniveau van doorgaans 25 kV of hoger en lager dan 110 kV
scope note: Spanningsniveaus worden op verschillende manieren gedefinieerd. Deze definitie gaat uit van de door netbeheerders meest gebruikte indeling. Andere indelingen kennen vaak geen tussenspanning.
status: submitted

netuitbreiding
type: Concept
broader: netaanpassingsopdracht
definition: toename in lengte, capaciteit of functionaliteit van een energienet
status: valid

invoeding
type: Concept
alternative label: opwek
alternative label: productie
alternative label: teruglevering
broader: energierichting
definition: inbrenging van energie op het energienet
status: valid

collectief capaciteitssturingscontract
type: Concept
alternative label: C-CSC
broader: capaciteitssturingscontract
definition: capaciteitssturingscontract met betrekking tot meerdere aansluitingen en met meerdere aangeslotenen als collectieve contractpartij
status: submitted

standaardjaarinvoeding
type: Concept
source: Begrippencode elektriciteit
alternative label: SJI
broader: standaardjaarvolume
definition: verwachte invoeding op een aansluiting bij gestandaardiseerde condities en op basis van een genormaliseerd jaar
status: valid

crisis
type: Concept
source: NBility
broader: richting (domein)
definition: noodsituatie waarbij het energietransport ernstig verstoord kan raken
status: valid

distributie
type: Concept
source: Energiewet
broader: energietransport
definition: energietransport op regionaal of lokaal niveau
status: submitted

medewerkersbeloning
type: Concept
source: NBility
broader: medewerker (domein)
definition: (meestal financiële) vergoeding voor arbeid en de daaraan verbonden onkosten
status: valid

financieel plan
type: Concept
source: NBility
broader: financiën (domein)
definition: door een organisatie in detail voorgenomen handelswijze om financiën te besturen zodat zij haar doelstellingen realiseert
status: valid

digitaalproductinstantie
type: Concept
source: NBility
broader: digitaal product (domein)
definition: levering van een digitaal product
status: valid

werkportfolio
type: Concept
source: NBility
broader: werk (domein)
definition: globale planning van werkzaamheden aan energienetten
status: valid

liquide middel
type: Concept
source: NBility
broader: financiën (domein)
definition: direct beschikbaar geld of direct opeisbaar tegoed
status: valid

bieding onder contract voor redispatchcapaciteit
type: Concept
alternative label: biedplichtcontract
broader: bieding redispatch
definition: bieding op verzoek van de netbeheerder, op basis van een contract voor redispatchcapaciteit en tegen marktgebaseerde voorwaarden
status: submitted

wervingsactie
type: Concept
source: NBility
broader: medewerker (domein)
definition: activiteit gericht op het aantrekken van nieuwe medewerkers
status: valid

datakwaliteitsregel
type: Concept
source: NBility
broader: proces en data (domein)
definition: beperking waar een dataset aan moet voldoen
status: valid

niet-beschikbaarheid
type: Concept
source: NBility
broader: energietransport (domein)
definition: situatie waarbij een of meer netfuncties tijdelijk niet kunnen worden gebruikt
status: valid

aangeslotene
type: Concept
source: Energiewet
broader: klant
definition: ieder die van een netbeheerder de beschikking heeft gekregen over een aansluiting
status: valid

kleinverbruikaansluiting
type: Concept
source: Begrippencode gas
source: Begrippencode elektriciteit
alternative label: KVB
broader: aansluiting
definition: kleine aansluiting, niet zijnde een aansluiting op een gesloten distributiesysteem of een aansluiting van een afnemer zoals bedoeld in artikel 1, tweede of derde lid, van de Elektriciteitswet 1998
editorial note: In aanvulling op de definities in de begrippencodes, wordt ook een aansluiting op een gesloten distributiesysteem niet beschouwd als kleinverbruikaansluiting.
status: valid

verbinding
type: Concept
broader: netfunctie
definition: object bestemd om daardoorheen of daarlangs energie te transporteren
status: valid

balanceringsverantwoordelijke
type: Concept
alternative label: BRP
broader: marktpartij
definition: natuurlijk persoon of rechtspersoon die verantwoordelijk is voor de onbalans die hij, of degene die hij vertegenwoordigt, veroorzaakt in het energienet en die door de netbeheerder als balancerinsverantwoordelijke is toegelaten
status: valid

toestemming van aangeslotene
type: Concept
source: NBility
broader: energienet (domein)
definition: goedkeuring door een (natuurlijk of niet-natuurlijk) persoon die beschikt over een aansluiting, aan een marktpartij om gegevens op te vragen of te verstrekken voor een bepaald doel
status: valid

verlof
type: Concept
source: NBility
broader: medewerker (domein)
definition: toestemming om gedurende een bepaalde periode afwezig te zijn op het werk
status: valid

middenspanning
type: Concept
alternative label: MS
broader: spanningsniveau
definition: spanningsniveau hoger dan 1 kV in geval van wisselspanning en hoger dan 1,5 kV in geval van gelijkspanning en gewoonlijk lager dan 25 kV
scope note: Spanningsniveaus worden op verschillende manieren gedefinieerd. Deze definitie gaat uit van de door netbeheerders meest gebruikte indeling. Andere veelgebruikte bovengrenzen voor middenspanning zijn 35, 50 en 110 kV.
status: submitted

werkopdracht
type: Concept
source: NBility
broader: werk (domein)
definition: autorisatie voor het uitvoeren van werk aan een energienet
status: valid

betalingsopdracht
type: Concept
source: NBility
broader: financiën (domein)
definition: opdracht aan een financiële instelling om geld over te dragen
status: valid

inkooporder
type: Concept
source: NBility
broader: inkoopproduct (domein)
definition: afspraak om goederen of diensten te leveren aan de netbeheerder tegen een overeengekomen prijs, eventueel onder de voorwaarden van een inkoopovereenkomst
status: valid

knooppunt
type: Concept
broader: netfunctie
definition: locatie in een energienet waar energiestromen worden verdeeld, omgezet of geregeld
status: submitted

inkoopovereenkomst
type: Concept
source: NBility
broader: inkoopproduct (domein)
definition: afspraak over de voorwaarden waaronder een partij goederen of diensten levert aan de netbeheerder
status: valid

transportbehoefte
type: Concept
source: NBility
broader: energiemarkt (domein)
definition: gewenste energietransport op lange termijn
status: valid

publieke laadinstallatie
type: Concept
broader: laadinstallatie
definition: algemeen toegankelijke laadinstallatie
status: submitted

vrije bieding redispatch
type: Concept
broader: bieding redispatch
definition: bieding redispatch zonder verzoek van de netbeheerder
status: submitted

bedrijfsgebouw
type: Concept
source: NBility
broader: bedrijfsgebouw (domein)
definition: gebouw waar duurzame uitoefening van de activiteiten van de netbeheerder plaatsvindt, niet zijnde een gebouw dat onderdeel uitmaakt van het energienet
status: valid

medewerkersstrategie
type: Concept
source: NBility
broader: medewerker (domein)
definition: algemene aanpak die een organisatie hanteert om medewerkers te werven en inzetbaar te houden zodat zij haar doelstellingen realiseert
status: valid

hoogspanning
type: Concept
alternative label: HS
broader: spanningsniveau
definition: spanningsniveau van 110 kV of hoger en lager dan 220 kV
scope note: Spanningsniveaus worden op verschillende manieren gedefinieerd. Deze definitie gaat uit van de door netbeheerders meest gebruikte indeling. Andere veelgebruikte ondergrenzen voor hoogspanning zijn 1, 25, 35 en 50 kV. Er is niet altijd een bovengrens.
status: submitted

bedrijfsgebouwenstrategie
type: Concept
source: NBility
broader: bedrijfsgebouw (domein)
definition: algemene aanpak die een organisatie hanteert om bedrijfsgebouwen en faciliteiten te beheren zodat zij haar doelstellingen realiseert
status: valid

netkwaliteit
type: Concept
source: NBility
broader: energienet (domein)
definition: mate waarin het energienet voldoet aan bepaalde normen
status: valid

kleine aansluiting
type: Concept
source: Energiewet
broader: aansluiting
definition: aansluiting met een doorlaatwaarde kleiner dan of gelijk aan 3 x 80 Ampère voor elektriciteit of 40 m3(n) per uur voor gas
scope note: Een aansluiting voor een streng van lichtmasten, waarbij elke lichtmast een eigen overdrachtspunt heeft met een doorlaatwaarde van ten hoogste 1 x 6 Ampère, geldt als kleine aansluiting, ongeacht het aantal overdrachtspunten.
status: valid

netstrategie
type: Concept
source: NBility
broader: energienet (domein)
definition: algemene aanpak die een organisatie hanteert om de ontwikkeling en instandhouding van energienetten te besturen zodat zij haar doelstellingen realiseert
status: valid

samenwerkingsverband
type: Concept
source: NBility
broader: richting (domein)
definition: afspraak tussen partijen in of rond de energiesector om een gemeenschappelijk doel na te streven
status: valid

facilitair product
type: Concept
source: NBility
broader: bedrijfsgebouw (domein)
definition: voorwerp of dienst die het gebruik van een bedrijfsgebouw ondersteunt
status: valid

laadpunt
type: Concept
broader: elektriciteitslaadeenheid
definition: één of meer connectoren voor het laden of ontladen van één mobiel apparaat tegelijk
status: submitted

laagspanning
type: Concept
alternative label: LS
broader: spanningsniveau
definition: spanningsniveau van 1 kV of lager in geval van wisselspanning en 1,5 kV of lager in geval van gelijkspanning
status: submitted

arbeidsplaats
type: Concept
source: NBility
broader: medewerker (domein)
definition: functie binnen een organisatieonderdeel, te vervullen door één medewerker
status: valid

private laadinstallatie
type: Concept
broader: laadinstallatie
definition: niet algemeen toegankelijke laadinstallatie
status: submitted

netvervanging
type: Concept
broader: onderhouds- of inspectieopdracht
definition: wisseling van één of meer netcomponenten als gevolg van economische veroudering of slijtage, zonder significante verandering in lengte, capaciteit of functionaliteit van het energienet
status: valid

transmissie
type: Concept
source: Energiewet
broader: energietransport
definition: energietransport op nationaal of internationaal niveau
status: submitted

medewerkersplan
type: Concept
source: NBility
broader: medewerker (domein)
definition: door een organisatie in detail voorgenomen handelswijze om medewerkers te werven en inzetbaar te houden zodat zij haar doelstellingen realiseert
status: valid

opregel- of afregelbehoefte
type: Concept
source: NBility
broader: energiemarkt (domein)
definition: verwachting van de hoeveelheid energie die moet worden opgeregeld of afgeregeld om het energietransport te handhaven
status: submitted

verbruiksinstallatie
type: Concept
source: Netcode elektriciteit
broader: installatie
definition: installatie voor het verbruiken van energie
status: valid

ziekteverzuim
type: Concept
source: NBility
broader: medewerker (domein)
definition: afwezigheid op het werk als gevolg van ziekte of gezondheidsproblemen
status: valid

bedieningshandeling
type: Concept
source: NBility
broader: energietransport (domein)
definition: verrichting die de bedrijfstoestand van een netdeel wijzigt
status: submitted

inkoopleveranciersprestatie
type: Concept
source: NBility
broader: inkoopproduct (domein)
definition: mate waarin een inkoopleverancier gestelde doelen of verplichtingen volbrengt
status: valid

materiaal
type: Concept
source: NBility
broader: werk (domein)
definition: product bestemd om verwerkt te worden tot netcomponent
status: valid

opregel- of afregelactie
type: Concept
source: NBility
broader: energietransport (domein)
definition: maatregel die door de netbeheerder wordt geactiveerd door een wijziging van het productie- en/of belastingspatroon op een of meer aansluitingen
status: submitted

netrevisie of bevinding
type: Concept
source: NBility
broader: werk (domein)
definition: weergave van een ter plaatse aangebrachte of geconstateerde wijziging van het energienet
status: valid

medewerkerinzet
type: Concept
source: NBility
broader: werk (domein)
definition: (gevraagde, geplande of daadwerkelijke) verbruik van de capaciteit van medewerkers
status: valid

werkactiviteit
type: Concept
source: NBility
broader: werk (domein)
definition: ter plaatse aanbrengen van wenselijk geachte veranderingen aan energienetten
status: valid

kwaliteitsknelpunt
type: Concept
source: NBility
broader: energienet (domein)
definition: delen van het energienet waarvan wordt verwacht dat zij vanwege vanwege afnemende functionaliteit, betrouwbaarheid of veroudering een aanzienlijk risico vormen voor een goede uitvoering van de bij of krachtens de wet aan de netbeheerder toegekende taken
status: valid

bedrijfsstrategie
type: Concept
source: NBility
broader: richting (domein)
definition: algemene aanpak die een organisatie hanteert om haar missie, visie, kernwaarden en doelstellingen te realiseren
status: valid

inkoopleverancier
type: Concept
source: NBility
broader: inkoopproduct (domein)
definition: partij die tegen betaling goederen of diensten levert aan de netbeheerder
status: valid

digitaalproductprestatie
type: Concept
source: NBility
broader: digitaal product (domein)
definition: mate waarin de instantie van een digitaal product afgesproken prestatiedoelen behaalt
status: valid

uitvoeringsvergunning
type: Concept
source: NBility
broader: werk (domein)
definition: beschikking op een aanvraag, die toestaat voorgenomen activiteiten voor bepaalde tijd te verrichten die in de wet- of regelgeving verboden zijn
status: valid

dataservice
type: Concept
source: NBility
broader: proces en data (domein)
definition: verzameling handelingen die toegang biedt tot één of meer datasets
status: valid

volledig variabel transportrecht
type: Concept
alternative label: reststroom
broader: alternatief transportrecht
definition: transportrecht dat de netbeheerder kort voor gebruik vrijgeeft
status: submitted

netberekening
type: Concept
source: NBility
broader: energienet (domein)
definition: kwantitatieve analyse om te bepalen of energietransporten in de toekomst met het huidige energienet zijn te realiseren
status: valid

grootverbruikaansluiting
type: Concept
source: Begrippencode gas
source: Begrippencode elektriciteit
alternative label: GVB
broader: aansluiting
definition: grote aansluiting, een aansluiting op een gesloten distributiesysteem, of een aansluiting van een afnemer zoals bedoeld in artikel 1, tweede of derde lid, van de Elektriciteitswet 1998
editorial note: In aanvulling op de definities in de begrippencodes, wordt ook een aansluiting op een gesloten distributiesysteem beschouwd als grootverbruikaansluiting.
status: valid

netbeheerdataverstrekking
type: Concept
source: NBility
broader: energiemarkt (domein)
definition: handeling waarbij de netbeheerder gegevens toegankelijk maakt, buiten de reguliere bedrijfsactiviteiten om
status: valid

netbeheerder
type: Concept
source: Elektriciteitswet 1998
source: Gaswet
alternative label: NB
broader: marktpartij
definition: vennootschap die op grond van de wet is aangewezen voor het beheer van een of meer energienetten, niet zijnde gesloten distributiesystemen
status: valid

aansluitcapaciteit
type: Concept
source: Begrippencode elektriciteit
broader: overdrachtspunt
definition: door aangeslotene gevraagde en door de netbeheerder ter beschikking gestelde hoeveelheid energie per tijdseenheid die via het overdrachtspunt van een aansluiting kan worden uitgewisseld
status: valid

energietoerekening
type: Concept
source: NBility
broader: energiemarkt (domein)
definition: verklaring dat uitgewisselde energie een marktpartij toebehoort
status: valid

capaciteitsknelpunt
type: Concept
source: NBility
broader: energienet (domein)
definition: delen van het energienet waarvan wordt verwacht dat zij vanwege een tekort aan transportcapaciteit of functionaliteit een aanzienlijk risico vormen voor een goede uitvoering van de bij of krachtens de wet aan de netbeheerder toegekende taken
status: valid

VGMK-richtlijn
type: Concept
source: NBility
broader: richting (domein)
definition: voorschrift ter bescherming van de veiligheid, de gezondheid, het milieu en/of de kwaliteit van werk
status: valid

gesloten distributiesysteem
type: Concept
source: Elektriciteitswet 1998
source: Gaswet
alternative label: GDS
broader: energienet
definition: energienet waarvoor ontheffing is verleend om het beheer toe te staan aan een andere partij dan de netbeheerder
status: valid

inkoopstrategie
type: Concept
source: NBility
broader: inkoopproduct (domein)
definition: algemene aanpak die een organisatie hanteert om goederen en diensten te verkrijgen zodat zij haar doelstellingen realiseert
status: valid

gezamenlijke aansluiting
type: Concept
source: Energiewet
broader: aansluiting
definition: aansluiting waarbij meerdere onroerende zaken voor de toepassing van de aansluiting worden beschouwd als één onroerende zaak
hidden label: cable pooling
status: submitted

waardering
type: Concept
source: NBility
broader: financiën (domein)
definition: vaststelling van de geldelijke waarde van bezittingen
status: valid

financiële stand
type: Concept
source: NBility
broader: financiën (domein)
definition: geldelijke waardering van een toestand
status: valid

storingsgrondoorzaak
type: Concept
source: NBility
broader: energienet (domein)
definition: fundamentele reden voor het optreden van een of meer storingen
status: valid

financiële strategie
type: Concept
source: NBility
broader: financiën (domein)
definition: algemene aanpak die een organisatie hanteert om financiën te besturen zodat zij haar doelstellingen realiseert
status: valid

organisatieonderdeel
type: Concept
source: NBility
broader: medewerker (domein)
definition: groep mensen binnen een organisatie die een gezamenlijk doel nastreven
status: valid

persoonscertificaat
type: Concept
source: NBility
broader: medewerker (domein)
definition: document dat bevestigt dat een natuurlijk persoon kennis, vaardigheden, competenties of kwalificaties heeft behaald
status: valid

netgebied
type: Concept
source: Begrippencode gas
source: Begrippencode elektriciteit
broader: aansluiting
definition: aaneengesloten en samenhangend deel van een energienet van één netbeheerder, waarbinnen de processen allocatie en reconciliatie plaatsvinden
status: valid

opregel- of afregelaanbod
type: Concept
source: NBility
broader: energiemarkt (domein)
definition: aanbod aan een netbeheerder om het productie- en/of belastingspatroon op een of meer aansluitingen te wijzigen
scope note: In NBility 2.3 bekend als 'opregel- of afregelaanbod', maar verandert in NBility 2.4 naar verwachting van naam.
status: submitted

meting (domein)
type: Concept
source: NBility
definition: bedrijfsobjecten die een netbeheerder bestuurt bij het meten van energietransport en energienetten
status: valid

klant
type: Concept
source: NBility
broader: klant (domein)
definition: (potentiële) afnemer van een product of dienst van de netbeheerder
scope note: Iemand die impact ondervindt van bedrijfsactiviteiten van de netbeheerder, beschouwen we ook als klant. In dat geval neemt deze klant bijvoorbeeld informatiediensten af.
status: valid

netcomponent
type: Concept
source: NBility
broader: energienet (domein)
definition: fysiek onderdeel van het energienet
status: valid

productie-installatie
type: Concept
source: Elektriciteitswet 1998
source: Gaswet
broader: installatie
definition: installatie voor het produceren van energie
status: valid

netaanpassingsopdracht
type: Concept
source: NBility
broader: energienet (domein)
definition: autorisatie voor de functionele wijziging van een energienet
status: valid

kleinverbruikmeetinrichting
type: Concept
source: Begrippencode elektriciteit
broader: meetinrichting
definition: meetinrichting bij een kleinverbruikaansluiting
status: valid

klantverzoek
type: Concept
source: NBility
broader: klant (domein)
definition: vraag van een klant om iets te doen of te laten
scope note: Hoewel een klacht slechts een uiting is van ontevredenheid, beschouwen we deze als een klantverzoek omdat de netbeheerder hier binnen een bepaalde termijn opvolging aan moet geven.
status: valid

telwerk
type: Concept
source: Begrippencode elektriciteit
broader: meetinrichting
definition: samenstel van cijferrollen dan wel een dataregister waarin de totale hoeveelheid uitgewisselde energie wordt vastgelegd
status: valid

opslaginstallatie
type: Concept
source: Netcode elektriciteit
broader: installatie
definition: installatie voor het opslaan van energie
status: valid

onderhouds- of inspectieopdracht
type: Concept
source: NBility
broader: energienet (domein)
definition: autorisatie voor activiteiten die als doel hebben het in een voor de netbeheerder aanvaardbare conditie houden (of terugbrengen) van netcomponenten teneinde de gevraagde mate van functionaliteit te borgen
status: valid

elektriciteitslaadeenheid
type: Concept
broader: laadinstallatie
definition: ondeelbaar geheel van elektrisch materieel en leidingen voor het opladen en/of ontladen van mobiele apparaten
status: submitted

meetinrichting
type: Concept
source: Energiewet
broader: aansluiting
definition: instrument of samenstel van instrumenten met een meetfunctie dat ten minste de invoeding, onttrekking of het verbruik van elektriciteit of gas meet, met uitzondering van hulpmiddelen die de meetfunctie ondersteunen en die onderdeel zijn van een aansluiting
hidden label: meter
status: valid

energietransport
type: Concept
source: NBility
broader: energietransport (domein)
definition: verplaatsing van energie via een energienet
status: valid

capaciteitssturingscontract
type: Concept
source: Netcode elektriciteit
alternative label: CSC
broader: klantovereenkomst
definition: afspraak om op verzoek van de netbeheer de energie-uitwisseling op een aansluiting tijdelijk boven of beneden een bepaalde grens te houden, ten behoeve van congestiebeheersing
hidden label:: CBC
hidden label:: capaciteitsbeperkingscontract
status: valid

overdrachtspunt
type: Concept
source: Begrippencode gas
source: Begrippencode elektriciteit
alternative label: aansluitpunt
broader: aansluiting
definition: overeengekomen grens waarop de verantwoordelijkheid overgaat van het energienet van de netbeheerder naar de installatie van de aangeslotene, of tussen twee energienetten
editorial note: Ten opzichte van de regelgeving, waarin het overdrachtspunt als een ‘fysiek punt’ wordt opgevat, biedt dit begrippenkader een preciezere definitie: een overeengekomen grens voor een eenduidige verantwoordelijkheidsverdeling, los van de fysieke realisatie.
status: valid

standaardjaarvolume
type: Concept
broader: energie-uitwisseling
definition: hoeveelheid energie-uitwisseling op basis van een genormaliseerd jaar
status: valid

energierichting
type: Concept
alternative label: leveringsrichting
broader: energie-uitwisseling
definition: kant waarop energie beweegt
status: valid

elektriciteitsproductie-eenheid
type: Concept
source: Verordening (EU) 2016/631 (NC RfG)
broader: productie-installatie
definition: synchrone elektriciteitsproductie-eenheid of power park module
status: valid

klantovereenkomst
type: Concept
source: NBility
broader: klant (domein)
definition: afspraak tussen een klant en de netbeheerder over wat ze met elkaar of voor elkaar zullen gaan doen of laten
status: valid

drukniveau
type: Concept
broader: energienet
definition: bereik van overdruk waarin een systeem opereert
status: submitted

transportcapaciteit
type: Concept
broader: netfunctie
definition: vermogen om een energiedrager te verplaatsen
status: valid

marktpartij
type: Concept
source: NBility
broader: energiemarkt (domein)
definition: partij die een rol vervult binnen de energiemarkt
scope note: Onder marktpartijen verstaan we niet de afnemers of toezichthouders van de energiemarkt.
status: valid

alternatief transportrecht
type: Concept
broader: transportrecht
definition: transportrecht dat niet altijd geldt
status: submitted

energienet
type: Concept
source: NBility
source: Elektriciteitswet 1998
source: Gaswet
broader: netfunctie
definition: stelsel van leidingen en daarmee verbonden hulpmiddelen ten behoeve van transport van energie
status: valid

transportrecht
type: Concept
broader: aansluiting
definition: recht van een aangeslotene om energie te transporteren over het energienet
status: submitted

bieding redispatch
type: Concept
source: Netcode elektriciteit
broader: opregel- of afregelaanbod
definition: aanbod om op een aansluiting op te regelen of af te regelen ten opzichte van een prognose voor die aansluiting
scope note: Een prognose wordt op de dag voorafgaand aan het transport ingediend.
status: submitted

bedrijfsgebouw (domein)
type: Concept
source: NBility
definition: bedrijfsobjecten die een netbeheerder bestuurt bij het beheren van bedrijfsgebouwen en beschikbaar stellen van faciliteiten
status: valid

laadinstallatie
type: Concept
broader: installatie
definition: installatie voor het opladen en/of ontladen van mobiele apparaten
status: valid

Elektriciteitswet 1998
type: Document

energie-uitwisseling
type: Concept
source: NBility
broader: energiemarkt (domein)
definition: afname dan wel invoeding van energie op een energienet
status: valid

Gaswet
type: Document

Verordening (EU) 2016/631 (NC RfG)
type: Document

netfunctie
type: Concept
source: NBility
broader: energienet (domein)
definition: taak of doel van een of meer (geplande) netcomponenten op een bepaalde locatie in het energienet
scope note: De netfuncties worden onderscheiden naar primair, secundiar, tertiair en telecom. Primaire netfunctie: een netfunctie voor energietransport. Secundaire netfunctie: een netfunctie voor het meten en/of sturen (inclusief beveiligen) van energietransport. Tertiaire netfunctie: een facilitaire voorziening voor de fysieke bescherming en/of ondersteuning van netcomponenten. Telecomnetfunctie: een onderdeel van een telecommunicatienetwerk bedoeld voor gegevensoverdracht van of naar een netfunctie.
status: valid

digitaal product (domein)
type: Concept
source: NBility
definition: bedrijfsobjecten die een netbeheerder bestuurt bij het ontwikkelen en beheren van digitale producten
status: valid

installatie
type: Concept
source: NBility
broader: energiemarkt (domein)
definition: samenstel van energietechnisch materiaal en leidingen van een aangeslotene, te rekenen na het overdrachtspunt van de aansluiting
status: valid

spanningsniveau
type: Concept
broader: energienet
definition: elektrisch spanningsbereik waarin een systeem opereert
status: submitted

proces en data (domein)
type: Concept
source: NBility
definition: bedrijfsobjecten die een netbeheerder bestuurt bij het ontwikkelen en beheren van processen en data
status: valid

inkoopproduct (domein)
type: Concept
source: NBility
definition: bedrijfsobjecten die een netbeheerder bestuurt bij het verkrijgen van goederen en diensten
status: valid

Begrippencode gas
type: Document

Energiewet
type: Document

aansluiting
type: Concept
source: NBility
broader: energiemarkt (domein)
definition: recht op het gebruik van één of meer verbindingen tussen een energienet en een onroerende zaak
scope note: In deze definitie is een aansluiting een gebruiksrecht op één of meer verbindingen met een energienet zoals een appartementsrecht een gebruiksrecht is op één of meer delen van een gebouw. Dit onderscheid tussen de aansluiting als gebruiksrecht en de aansluitverbindingen waar dat recht op rust, maakt de aansluiting eenduidig identificeerbaar.
status: valid

Netcode elektriciteit
type: Document

financiën (domein)
type: Concept
source: NBility
definition: bedrijfsobjecten die een netbeheerder bestuurt bij het verkrijgen en beheren van financiën
status: valid

energietransport (domein)
type: Concept
source: NBility
definition: bedrijfsobjecten die een netbeheerder bestuurt bij het transporteren van energie
status: valid

energiemarkt (domein)
type: Concept
source: NBility
definition: bedrijfsobjecten die een netbeheerder bestuurt bij het faciliteren van de energiemarkt
status: valid

werk (domein)
type: Concept
source: NBility
definition: bedrijfsobjecten die een netbeheerder bestuurt bij het uitvoeren van werkzaamheden aan energienetten
status: valid

medewerker (domein)
type: Concept
source: NBility
definition: bedrijfsobjecten die een netbeheerder bestuurt bij het werven en inzetbaar houden van medewerkers
status: valid

klant (domein)
type: Concept
source: NBility
definition: bedrijfsobjecten die een netbeheerder bestuurt bij het bedienen van klanten
status: valid

Begrippencode elektriciteit
type: Document

richting (domein)
type: Concept
source: NBility
definition: bedrijfsobjecten die een netbeheerder bestuurt bij het opstellen en besturen van de bedrijfsrichting
status: valid

energienet (domein)
type: Concept
source: NBility
definition: bedrijfsobjecten die een netbeheerder bestuurt bij het besturen van de ontwikkeling en instandhouding van energienetten
status: valid

NBility
type: Document

Begrippenkader van Netbeheer Nederland
type: ConceptScheme
comment: Dit begrippenkader definieert de soorten dingen die worden beheerd door de Nederlanse transmissie- en distributiesysteembeheerders bij de uitvoering van de economische activiteiten 3513 (Transmissie van elektriciteit), 3514 (Distributie van elektriciteit), 4950 (Transport via pijpleidingen) en 3522 (Distributie van gasvormige brandstoffen via leidingen). De begrippen op het hoogste niveau in de hiërarchie zijn gedefinieerd door NBility.